Target
Mitochondrial import inner membrane translocase subunit TIM10
Ligand
BDBM77795
Substrate
Meas. Tech.
SAR analysis of small molecule inhibitors of tim23-1: a luminescent TIM10 yeast counterscreen.
IC50
14200±n/a nM
Citation
 PubChem, PC SAR analysis of small molecule inhibitors of tim23-1: a luminescent TIM10 yeast counterscreen. PubChem Bioassay (2012)[AID] 
Target
Name:
Mitochondrial import inner membrane translocase subunit TIM10
Synonyms:
MRS11 TIM10_YEAST TPA: Essential protein of the mitochondrial intermembrane space, forms a complex with Tim9p (TIM10 complex) that delivers hydrophobic proteins to the TIM22 complex for insertion into the inner ...
Type:
Enzyme Catalytic Domain
Mol. Mass.:
10303.50
Organism:
Saccharomyces cerevisiae S288c
Description:
gi_285809906
Residue:
93
  
Inhibitor
Name:
BDBM77795
Synonyms:
(E)-3-(4-Chloro-phenyl)-2-cyano-N-pyridin-3-yl-acrylamide (E)-3-(4-chlorophenyl)-2-cyano-N-(3-pyridyl)acrylamide (E)-3-(4-chlorophenyl)-2-cyano-N-pyridin-3-ylprop-2-enamide SMR000431355 | cid_5548040
Type:
Small organic molecule
Emp. Form.:
C15H10ClN3O
Mol. Mass.:
283.712
SMILES:
Clc1ccc(\C=C(/C#N)C(=O)Nc2cccnc2)cc1
: