Target
Mitochondrial import inner membrane translocase subunit TIM10
Ligand
BDBM77793
Substrate
Meas. Tech.
SAR analysis of small molecule inhibitors of tim23-1: a luminescent TIM10 yeast counterscreen.
IC50
4040±n/a nM
Citation
 PubChem, PC SAR analysis of small molecule inhibitors of tim23-1: a luminescent TIM10 yeast counterscreen. PubChem Bioassay (2012)[AID] 
Target
Name:
Mitochondrial import inner membrane translocase subunit TIM10
Synonyms:
MRS11 TIM10_YEAST TPA: Essential protein of the mitochondrial intermembrane space, forms a complex with Tim9p (TIM10 complex) that delivers hydrophobic proteins to the TIM22 complex for insertion into the inner ...
Type:
Enzyme Catalytic Domain
Mol. Mass.:
10303.50
Organism:
Saccharomyces cerevisiae S288c
Description:
gi_285809906
Residue:
93
  
Inhibitor
Name:
BDBM77793
Synonyms:
(2-Pyridin-3-yl-quinazolin-4-yl)-p-tolyl-amine N-(4-methylphenyl)-2-(3-pyridinyl)-4-quinazolinamine N-(4-methylphenyl)-2-pyridin-3-ylquinazolin-4-amine cid_921932 | p-tolyl-[2-(3-pyridyl)quinazolin-4-yl]amine
Type:
Small organic molecule
Emp. Form.:
C20H16N4
Mol. Mass.:
312.3678
SMILES:
Cc1ccc(Nc2nc(nc3ccccc23)-c2cccnc2)cc1
: