Target
Zinc finger protein GLI1
Ligand
BDBM37197
Substrate
Meas. Tech.
Dose response confirmation of uHTS antagonist hits from Gli-SUFU in a luminescent reporter assay
IC50
2220±n/a nM
Citation
 PubChem, PC Dose response confirmation of uHTS antagonist hits from Gli-SUFU in a luminescent reporter assay PubChem Bioassay (2012)[AID] 
Target
Name:
Zinc finger protein GLI1
Synonyms:
GLI1_MOUSE Gli1 | Glioma-associated oncogene homolog
Type:
PROTEIN
Mol. Mass.:
118579.34
Organism:
Mus musculus
Description:
EBI_101259
Residue:
1111
  
Inhibitor
Name:
BDBM37197
Synonyms:
3-methyl-4-oxo-6-(3,4,5-trimethoxyphenyl)-1,5,6,7-tetrahydroindole-2-carboxylic acid butyl ester MLS000116503 butyl 3-methyl-4-oxidanylidene-6-(3,4,5-trimethoxyphenyl)-1,5,6,7-tetrahydroindole-2-carboxylate cid_5309717
Type:
Small organic molecule
Emp. Form.:
C23H29NO6
Mol. Mass.:
415.4795
SMILES:
CCCCOC(=O)c1[nH]c2CC(CC(=O)c2c1C)c1cc(OC)c(OC)c(OC)c1
: