Target
Kallikrein-7
Ligand
BDBM113060
Substrate
Meas. Tech.
KLK7 Assay
pH
7.2±n/a
Temperature
310.15±n/a K
Ki
48±n/a nM
Comments
extracted
Citation
 Wagberg, FLeonardsson, G Benzoxazinone derivatives for treatment of skin diseases US Patent  US9695194 Publication Date 7/4/2017 
Target
Name:
Kallikrein-7
Synonyms:
KLK7 Kallikrein 7 PRSS6 Serine protease 6 hK7 kallikrein-7 isoform 1 preproprotein
Type:
PROTEIN
Mol. Mass.:
27535.05
Organism:
Homo sapiens (Human)
Description:
ChEMBL_1469257
Residue:
253
  
Inhibitor
Name:
BDBM113060
Synonyms:
US9695194, 1
Type:
Small organic molecule
Emp. Form.:
C18H17NO4S
Mol. Mass.:
343.397
SMILES:
CCOc1cc2c(cc1OC)nc(oc2=O)-c1ccccc1SC
: