Target
Kallikrein-7
Ligand
BDBM113294
Substrate
Meas. Tech.
KLK7 Assay
pH
7.2±n/a
Temperature
310.15±n/a K
Ki
1370±n/a nM
Comments
extracted
Citation
 Wagberg, FLeonardsson, G Benzoxazinone derivatives for treatment of skin diseases US Patent  US9695194 Publication Date 7/4/2017 
Target
Name:
Kallikrein-7
Synonyms:
KLK7 Kallikrein 7 PRSS6 Serine protease 6 hK7 kallikrein-7 isoform 1 preproprotein
Type:
PROTEIN
Mol. Mass.:
27535.05
Organism:
Homo sapiens (Human)
Description:
ChEMBL_1469257
Residue:
253
  
Inhibitor
Name:
BDBM113294
Synonyms:
US9695194, 11
Type:
Small organic molecule
Emp. Form.:
C23H25NO4
Mol. Mass.:
379.4489
SMILES:
CC(C)c1ccc(-c2nc3cc4OCCCOc4cc3c(=O)o2)c(c1)C(C)C
: