Target
Kallikrein-7
Ligand
BDBM113299
Substrate
Meas. Tech.
KLK7 Assay
pH
7.2±n/a
Temperature
310.15±n/a K
Ki
105±n/a nM
Comments
extracted
Citation
 Wagberg, FLeonardsson, G Benzoxazinone derivatives for treatment of skin diseases US Patent  US9695194 Publication Date 7/4/2017 
Target
Name:
Kallikrein-7
Synonyms:
KLK7 Kallikrein 7 PRSS6 Serine protease 6 hK7 kallikrein-7 isoform 1 preproprotein
Type:
PROTEIN
Mol. Mass.:
27535.05
Organism:
Homo sapiens (Human)
Description:
ChEMBL_1469257
Residue:
253
  
Inhibitor
Name:
BDBM113299
Synonyms:
US9695194, 15
Type:
Small organic molecule
Emp. Form.:
C18H17NO6
Mol. Mass.:
343.3307
SMILES:
COC1CC(OC)=CC=C1c1nc2cc3OCCOc3cc2c(=O)o1
: