Target
Prothrombin
Ligand
BDBM113299
Substrate
Meas. Tech.
Thrombin Assay
pH
8.3±n/a
Temperature
310.15±n/a K
Ki
600±n/a nM
Comments
extracted
Citation
 Wagberg, FLeonardsson, G Benzoxazinone derivatives for treatment of skin diseases US Patent  US9695194 Publication Date 7/4/2017 
Target
Name:
Prothrombin
Synonyms:
Activation peptide fragment 1 Coagulation factor II Prothrombin precursor Thrombin heavy chain | Thrombin light chain
Type:
Protein
Mol. Mass.:
70029.57
Organism:
Homo sapiens (Human)
Description:
P00734
Residue:
622
  
Inhibitor
Name:
BDBM113299
Synonyms:
US9695194, 15
Type:
Small organic molecule
Emp. Form.:
C18H17NO6
Mol. Mass.:
343.3307
SMILES:
COC1CC(OC)=CC=C1c1nc2cc3OCCOc3cc2c(=O)o1
: