Target
Kallikrein-7
Ligand
BDBM50289001
Substrate
Meas. Tech.
KLK7 Assay
pH
7.2±n/a
Temperature
310.15±n/a K
Ki
100±n/a nM
Comments
extracted
Citation
 Wagberg, FLeonardsson, G Benzoxazinone derivatives for treatment of skin diseases US Patent  US9695194 Publication Date 7/4/2017 
Target
Name:
Kallikrein-7
Synonyms:
KLK7 Kallikrein 7 PRSS6 Serine protease 6 hK7 kallikrein-7 isoform 1 preproprotein
Type:
PROTEIN
Mol. Mass.:
27535.05
Organism:
Homo sapiens (Human)
Description:
ChEMBL_1469257
Residue:
253
  
Inhibitor
Name:
BDBM50289001
Synonyms:
2-(2-Iodo-phenyl)-6,7-dimethoxy-benzo[d][1,3]oxazin-4-one US9695194, 18
Type:
Small organic molecule
Emp. Form.:
C16H12INO4
Mol. Mass.:
409.1753
SMILES:
COc1cc2nc(oc(=O)c2cc1OC)-c1ccccc1I
: