Target
Interleukin-1 receptor-associated kinase 4
Ligand
BDBM278831
Substrate
Meas. Tech.
IRAK4 Kinase Assay
pH
7.2±n/a
IC50
30.0±n/a nM
Comments
extracted
Citation
 Lim, JAltman, MDGibeau, CR Thienopyrazine inhibitors of IRAK4 activity US Patent  US10040802 Publication Date 8/7/2018 
Target
Name:
Interleukin-1 receptor-associated kinase 4
Synonyms:
IRAK-4 IRAK4_HUMAN Interleukin-1 receptor-associated kinase 4 (IRAK4) | Renal carcinoma antigen NY-REN-64
Type:
Protein
Mol. Mass.:
51519.08
Organism:
Homo sapiens (Human)
Description:
Q9NWZ3
Residue:
460
  
Inhibitor
Name:
BDBM278831
Synonyms:
N-[3-(difluoromethyl)- 1-methyl-1H-pyrazol- 4-yl]-2-{[(1R,2S)-2- hydroxycyclohexyl] amino}thieno[2,3-b] pyrazine-7- carboxamide | US10040802, Example 10
Type:
Small organic molecule
Emp. Form.:
C18H20F2N6O2S
Mol. Mass.:
422.452
SMILES:
Cn1cc(NC(=O)c2csc3ncc(N[C@@H]4CCCC[C@@H]4O)nc23)c(n1)C(F)F
: