Target
Interleukin-1 receptor-associated kinase 4
Ligand
BDBM278834
Substrate
Meas. Tech.
IRAK4 Kinase Assay
pH
7.2±n/a
IC50
6.00±n/a nM
Comments
extracted
Citation
 Lim, JAltman, MDGibeau, CR Thienopyrazine inhibitors of IRAK4 activity US Patent  US10040802 Publication Date 8/7/2018 
Target
Name:
Interleukin-1 receptor-associated kinase 4
Synonyms:
IRAK-4 IRAK4_HUMAN Interleukin-1 receptor-associated kinase 4 (IRAK4) | Renal carcinoma antigen NY-REN-64
Type:
Protein
Mol. Mass.:
51519.08
Organism:
Homo sapiens (Human)
Description:
Q9NWZ3
Residue:
460
  
Inhibitor
Name:
BDBM278834
Synonyms:
2-(5,8- diazaspiro[2.6]non-5- yl)-N-[3- (difluoromethyl)-1- methyl-1H-pyrazol-4- yl]thieno[2,3-b] pyrazine-7- carboxamide trifluoroacetate | US10040802, Example 13
Type:
Small organic molecule
Emp. Form.:
C21H22F5N7O3S
Mol. Mass.:
547.501
SMILES:
OC(=O)C(F)(F)F.Cn1cc(NC(=O)c2csc3ncc(nc23)N2CCNCC3(CC3)C2)c(n1)C(F)F
: