Target
Interleukin-1 receptor-associated kinase 4
Ligand
BDBM50130660
Substrate
Meas. Tech.
IRAK4 Kinase Assay
pH
7.2±n/a
IC50
0.400±n/a nM
Comments
extracted
Citation
 Lim, JAltman, MDGibeau, CR Thienopyrazine inhibitors of IRAK4 activity US Patent  US10040802 Publication Date 8/7/2018 
Target
Name:
Interleukin-1 receptor-associated kinase 4
Synonyms:
IRAK-4 IRAK4_HUMAN Interleukin-1 receptor-associated kinase 4 (IRAK4) | Renal carcinoma antigen NY-REN-64
Type:
Protein
Mol. Mass.:
51519.08
Organism:
Homo sapiens (Human)
Description:
Q9NWZ3
Residue:
460
  
Inhibitor
Name:
BDBM50130660
Synonyms:
CHEMBL3634509 | US10040802, Example 32
Type:
Small organic molecule
Emp. Form.:
C17H19F2N7OS
Mol. Mass.:
407.441
SMILES:
Cn1cc(NC(=O)c2csc3ncc(N[C@@H]4CCCNC4)nc23)c(n1)C(F)F
: