Target
Interleukin-1 receptor-associated kinase 4
Ligand
BDBM278856
Substrate
Meas. Tech.
IRAK4 Kinase Assay
pH
7.2±n/a
IC50
0.300±n/a nM
Comments
extracted
Citation
 Lim, JAltman, MDGibeau, CR Thienopyrazine inhibitors of IRAK4 activity US Patent  US10040802 Publication Date 8/7/2018 
Target
Name:
Interleukin-1 receptor-associated kinase 4
Synonyms:
IRAK-4 IRAK4_HUMAN Interleukin-1 receptor-associated kinase 4 (IRAK4) | Renal carcinoma antigen NY-REN-64
Type:
Protein
Mol. Mass.:
51519.08
Organism:
Homo sapiens (Human)
Description:
Q9NWZ3
Residue:
460
  
Inhibitor
Name:
BDBM278856
Synonyms:
2-{[(1R,2S)-2- aminocyclohexyl]amino}- N-(3-chloro-1- methyl-1H-pyrazol- 4-yl)thieno[2,3-b] pyrazine-7- carboxamide trifluoroacetate | US10040802, Example 35
Type:
Small organic molecule
Emp. Form.:
C19H21ClF3N7O3S
Mol. Mass.:
519.928
SMILES:
OC(=O)C(F)(F)F.Cn1cc(NC(=O)c2csc3ncc(N[C@@H]4CCCC[C@@H]4N)nc23)c(Cl)n1
: