Target
Interleukin-1 receptor-associated kinase 4
Ligand
BDBM278897
Substrate
Meas. Tech.
IRAK4 Kinase Assay
pH
7.2±n/a
IC50
12.0±n/a nM
Comments
extracted
Citation
 Lim, JAltman, MDGibeau, CR Thienopyrazine inhibitors of IRAK4 activity US Patent  US10040802 Publication Date 8/7/2018 
Target
Name:
Interleukin-1 receptor-associated kinase 4
Synonyms:
IRAK-4 IRAK4_HUMAN Interleukin-1 receptor-associated kinase 4 (IRAK4) | Renal carcinoma antigen NY-REN-64
Type:
Protein
Mol. Mass.:
51519.08
Organism:
Homo sapiens (Human)
Description:
Q9NWZ3
Residue:
460
  
Inhibitor
Name:
BDBM278897
Synonyms:
2-{[(1R,2S)-2-amino- cyclohexyl]amino}- N-(2-(trifluoromethyl) thiophen-3-yl] thieno[2,3-b] pyrazine-7- carboxamide trifluoroacetate | US10040802, Example 76
Type:
Small organic molecule
Emp. Form.:
C20H19F6N5O3S2
Mol. Mass.:
555.517
SMILES:
OC(=O)C(F)(F)F.N[C@H]1CCCC[C@H]1Nc1cnc2scc(C(=O)Nc3ccsc3C(F)(F)F)c2n1
: