Target
Interleukin-1 receptor-associated kinase 4
Ligand
BDBM278904
Substrate
Meas. Tech.
IRAK4 Kinase Assay
pH
7.2±n/a
IC50
33.0±n/a nM
Comments
extracted
Citation
 Lim, JAltman, MDGibeau, CR Thienopyrazine inhibitors of IRAK4 activity US Patent  US10040802 Publication Date 8/7/2018 
Target
Name:
Interleukin-1 receptor-associated kinase 4
Synonyms:
IRAK-4 IRAK4_HUMAN Interleukin-1 receptor-associated kinase 4 (IRAK4) | Renal carcinoma antigen NY-REN-64
Type:
Protein
Mol. Mass.:
51519.08
Organism:
Homo sapiens (Human)
Description:
Q9NWZ3
Residue:
460
  
Inhibitor
Name:
BDBM278904
Synonyms:
2-[(3R)-3- aminopiperidin- 1-yl]-N-(2- cyanophenyl)- thieno[2,3-b]- pyrazine-7- carboxamide trifluoroacetate | US10040802, Example 84
Type:
Small organic molecule
Emp. Form.:
C21H19F3N6O3S
Mol. Mass.:
492.474
SMILES:
OC(=O)C(F)(F)F.N[C@@H]1CCCN(C1)c1cnc2scc(C(=O)Nc3ccccc3C#N)c2n1
: