Target
Interleukin-1 receptor-associated kinase 4
Ligand
BDBM278905
Substrate
Meas. Tech.
IRAK4 Kinase Assay
pH
7.2±n/a
IC50
2.00±n/a nM
Comments
extracted
Citation
 Lim, JAltman, MDGibeau, CR Thienopyrazine inhibitors of IRAK4 activity US Patent  US10040802 Publication Date 8/7/2018 
Target
Name:
Interleukin-1 receptor-associated kinase 4
Synonyms:
IRAK-4 IRAK4_HUMAN Interleukin-1 receptor-associated kinase 4 (IRAK4) | Renal carcinoma antigen NY-REN-64
Type:
Protein
Mol. Mass.:
51519.08
Organism:
Homo sapiens (Human)
Description:
Q9NWZ3
Residue:
460
  
Inhibitor
Name:
BDBM278905
Synonyms:
N-(2- cyanophenyl)-2- [(3R)-piperidin- 3-ylamino]- thieno[2,3-b]- pyrazine-7- carboxamide trifluoroacetate | US10040802, Example 85
Type:
Small organic molecule
Emp. Form.:
C21H19F3N6O3S
Mol. Mass.:
492.474
SMILES:
OC(=O)C(F)(F)F.O=C(Nc1ccccc1C#N)c1csc2ncc(N[C@@H]3CCCNC3)nc12
: