Target
Interleukin-1 receptor-associated kinase 4
Ligand
BDBM278907
Substrate
Meas. Tech.
IRAK4 Kinase Assay
pH
7.2±n/a
IC50
2.00±n/a nM
Comments
extracted
Citation
 Lim, JAltman, MDGibeau, CR Thienopyrazine inhibitors of IRAK4 activity US Patent  US10040802 Publication Date 8/7/2018 
Target
Name:
Interleukin-1 receptor-associated kinase 4
Synonyms:
IRAK-4 IRAK4_HUMAN Interleukin-1 receptor-associated kinase 4 (IRAK4) | Renal carcinoma antigen NY-REN-64
Type:
Protein
Mol. Mass.:
51519.08
Organism:
Homo sapiens (Human)
Description:
Q9NWZ3
Residue:
460
  
Inhibitor
Name:
BDBM278907
Synonyms:
2-{[(1R,2S)-2- aminocyclohexyl]- amino}-N-(2- bromophenyl)- thieno[2,3-b]- pyrazine-7- carboxamide trifluoroacetate | US10040802, Example 87
Type:
Small organic molecule
Emp. Form.:
C21H21BrF3N5O3S
Mol. Mass.:
560.387
SMILES:
OC(=O)C(F)(F)F.N[C@H]1CCCC[C@H]1Nc1cnc2scc(C(=O)Nc3ccccc3Br)c2n1
: