Target
Interleukin-1 receptor-associated kinase 4
Ligand
BDBM278913
Substrate
Meas. Tech.
IRAK4 Kinase Assay
pH
7.2±n/a
IC50
4.00±n/a nM
Comments
extracted
Citation
 Lim, JAltman, MDGibeau, CR Thienopyrazine inhibitors of IRAK4 activity US Patent  US10040802 Publication Date 8/7/2018 
Target
Name:
Interleukin-1 receptor-associated kinase 4
Synonyms:
IRAK-4 IRAK4_HUMAN Interleukin-1 receptor-associated kinase 4 (IRAK4) | Renal carcinoma antigen NY-REN-64
Type:
Protein
Mol. Mass.:
51519.08
Organism:
Homo sapiens (Human)
Description:
Q9NWZ3
Residue:
460
  
Inhibitor
Name:
BDBM278913
Synonyms:
2-[(3S)- or (3R)- azepan-3- ylamino]-N-(2- cyanophenyl)- thieno[2,3-b]- pyrazine-7- carboxamide trifluoroacetate | US10040802, Example 93
Type:
Small organic molecule
Emp. Form.:
C22H21F3N6O3S
Mol. Mass.:
506.501
SMILES:
OC(=O)C(F)(F)F.O=C(Nc1ccccc1C#N)c1csc2ncc(N[C@H]3CCCCNC3)nc12
: