Target
Tyrosine-protein phosphatase non-receptor type 22
Ligand
BDBM39936
Substrate
Meas. Tech.
Dose Response selectivity of inhibitors of STriatal-Enriched Phosphatase (STEP) in the Lymphoid Phosphatase (PTPN22) Inhibition Assay
IC50
>100000±0 nM
Citation
 PubChem, PC Dose Response selectivity of inhibitors of STriatal-Enriched Phosphatase (STEP) in the Lymphoid Phosphatase (PTPN22) Inhibition Assay PubChem Bioassay (2012)[AID] 
Target
Name:
Tyrosine-protein phosphatase non-receptor type 22
Synonyms:
3.1.3.48 LyP Lymphoid phosphatase (Lyp) PEST-domain phosphatase PTPN22 Tyrosine-protein phosphatase non-receptor type 22 (LYP) | tyrosine-protein phosphatase non-receptor type 22 isoform 1
Type:
Mol. Mass.:
91712.31
Organism:
Homo sapiens (Human)
Description:
Q9Y2R2
Residue:
807
  
Inhibitor
Name:
BDBM39936
Synonyms:
(3aR,6aS)-3-(2-chlorophenyl)-5-(2,5-dimethoxyphenyl)-3a,6a-dihydropyrrol[3,4-d]isoxazole-4,6-quinone (3aR,6aS)-3-(2-chlorophenyl)-5-(2,5-dimethoxyphenyl)-3a,6a-dihydropyrrolo[3,4-d]isoxazole-4,6-dione SMR000046218 | cid_665287
Type:
Small organic molecule
Emp. Form.:
C19H15ClN2O5
Mol. Mass.:
386.786
SMILES:
COc1ccc(OC)c(c1)-n1c(O)c2o[nH]c(-c3ccccc3Cl)c2c1=O
: