Target
Tyrosine-protein phosphatase non-receptor type 22
Ligand
BDBM88731
Substrate
Meas. Tech.
Dose Response selectivity of inhibitors of STriatal-Enriched Phosphatase (STEP) in the Lymphoid Phosphatase (PTPN22) Inhibition Assay
IC50
75558±26700 nM
Citation
 PubChem, PC Dose Response selectivity of inhibitors of STriatal-Enriched Phosphatase (STEP) in the Lymphoid Phosphatase (PTPN22) Inhibition Assay PubChem Bioassay (2012)[AID] 
Target
Name:
Tyrosine-protein phosphatase non-receptor type 22
Synonyms:
3.1.3.48 LyP Lymphoid phosphatase (Lyp) PEST-domain phosphatase PTPN22 Tyrosine-protein phosphatase non-receptor type 22 (LYP) | tyrosine-protein phosphatase non-receptor type 22 isoform 1
Type:
Mol. Mass.:
91712.31
Organism:
Homo sapiens (Human)
Description:
Q9Y2R2
Residue:
807
  
Inhibitor
Name:
BDBM88731
Synonyms:
3-[[5-(1-ethylpropyl)-1,3,4-thiadiazol-2-yl]carbamoyl]-5-nitro-benzoic acid methyl ester MLS000579956 cid_2162931 methyl 3-nitro-5-[(5-pentan-3-yl-1,3,4-thiadiazol-2-yl)carbamoyl]benzoate
Type:
Small organic molecule
Emp. Form.:
C16H18N4O5S
Mol. Mass.:
378.403
SMILES:
CCC(CC)c1nnc(NC(=O)c2cc(cc(c2)[N+]([O-])=O)C(=O)OC)s1
: