Target
Tyrosine-protein phosphatase non-receptor type 22
Ligand
BDBM88733
Substrate
Meas. Tech.
Dose Response selectivity of inhibitors of STriatal-Enriched Phosphatase (STEP) in the Lymphoid Phosphatase (PTPN22) Inhibition Assay
IC50
38548±17100 nM
Citation
 PubChem, PC Dose Response selectivity of inhibitors of STriatal-Enriched Phosphatase (STEP) in the Lymphoid Phosphatase (PTPN22) Inhibition Assay PubChem Bioassay (2012)[AID] 
Target
Name:
Tyrosine-protein phosphatase non-receptor type 22
Synonyms:
3.1.3.48 LyP Lymphoid phosphatase (Lyp) PEST-domain phosphatase PTPN22 Tyrosine-protein phosphatase non-receptor type 22 (LYP) | tyrosine-protein phosphatase non-receptor type 22 isoform 1
Type:
Mol. Mass.:
91712.31
Organism:
Homo sapiens (Human)
Description:
Q9Y2R2
Residue:
807
  
Inhibitor
Name:
BDBM88733
Synonyms:
3-(5-chloranyl-2-methoxy-phenyl)-1-[(1-methylindol-3-yl)methyl]-1-(3-morpholin-4-ylpropyl)thiourea 3-(5-chloro-2-methoxyphenyl)-1-[(1-methyl-3-indolyl)methyl]-1-[3-(4-morpholinyl)propyl]thiourea MLS000583931 SMR000206917 | cid_12004930
Type:
Small organic molecule
Emp. Form.:
C25H31ClN4O2S
Mol. Mass.:
487.057
SMILES:
COc1ccc(Cl)cc1NC(=S)N(CCCN1CCOCC1)Cc1cn(C)c2ccccc12
: