Target
Tyrosine-protein phosphatase non-receptor type 22
Ligand
BDBM82742
Substrate
Meas. Tech.
Dose Response selectivity of inhibitors of STriatal-Enriched Phosphatase (STEP) in the Lymphoid Phosphatase (PTPN22) Inhibition Assay
IC50
22936±7110 nM
Citation
 PubChem, PC Dose Response selectivity of inhibitors of STriatal-Enriched Phosphatase (STEP) in the Lymphoid Phosphatase (PTPN22) Inhibition Assay PubChem Bioassay (2012)[AID] 
Target
Name:
Tyrosine-protein phosphatase non-receptor type 22
Synonyms:
3.1.3.48 LyP Lymphoid phosphatase (Lyp) PEST-domain phosphatase PTPN22 Tyrosine-protein phosphatase non-receptor type 22 (LYP) | tyrosine-protein phosphatase non-receptor type 22 isoform 1
Type:
Mol. Mass.:
91712.31
Organism:
Homo sapiens (Human)
Description:
Q9Y2R2
Residue:
807
  
Inhibitor
Name:
BDBM82742
Synonyms:
5-chloro-2-thiophenecarboxylic acid [4-[(E)-2-(1H-benzimidazol-2-yl)-2-cyanoethenyl]phenyl] ester MLS000374997 [4-[(E)-2-(1H-benzimidazol-2-yl)-2-cyano-ethenyl]phenyl] 5-chloranylthiophene-2-carboxylate cid_5767238
Type:
Small organic molecule
Emp. Form.:
C21H12ClN3O2S
Mol. Mass.:
405.857
SMILES:
Clc1ccc(s1)C(=O)Oc1ccc(\C=C(/C#N)c2nc3ccccc3[nH]2)cc1
: