Target
Tyrosine-protein phosphatase non-receptor type 22
Ligand
BDBM61518
Substrate
Meas. Tech.
Dose Response selectivity of inhibitors of STriatal-Enriched Phosphatase (STEP) in the Lymphoid Phosphatase (PTPN22) Inhibition Assay
IC50
31425±4340 nM
Citation
 PubChem, PC Dose Response selectivity of inhibitors of STriatal-Enriched Phosphatase (STEP) in the Lymphoid Phosphatase (PTPN22) Inhibition Assay PubChem Bioassay (2012)[AID] 
Target
Name:
Tyrosine-protein phosphatase non-receptor type 22
Synonyms:
3.1.3.48 LyP Lymphoid phosphatase (Lyp) PEST-domain phosphatase PTPN22 Tyrosine-protein phosphatase non-receptor type 22 (LYP) | tyrosine-protein phosphatase non-receptor type 22 isoform 1
Type:
Mol. Mass.:
91712.31
Organism:
Homo sapiens (Human)
Description:
Q9Y2R2
Residue:
807
  
Inhibitor
Name:
BDBM61518
Synonyms:
1-[3-[(2-methoxyphenyl)sulfamoyl]-4-(4-morpholinyl)phenyl]-3-[2-(4-morpholinyl)ethyl]thiourea 1-[3-[(2-methoxyphenyl)sulfamoyl]-4-morpholin-4-ylphenyl]-3-(2-morpholin-4-ylethyl)thiourea MLS000409155 cid_3598171
Type:
Small organic molecule
Emp. Form.:
C24H33N5O5S2
Mol. Mass.:
535.679
SMILES:
COc1ccccc1NS(=O)(=O)c1cc(NC(=S)NCCN2CCOCC2)ccc1N1CCOCC1
: