Target
Tyrosine-protein phosphatase non-receptor type 22
Ligand
BDBM88749
Substrate
Meas. Tech.
Dose Response selectivity of inhibitors of STriatal-Enriched Phosphatase (STEP) in the Lymphoid Phosphatase (PTPN22) Inhibition Assay
IC50
48856±3190 nM
Citation
 PubChem, PC Dose Response selectivity of inhibitors of STriatal-Enriched Phosphatase (STEP) in the Lymphoid Phosphatase (PTPN22) Inhibition Assay PubChem Bioassay (2012)[AID] 
Target
Name:
Tyrosine-protein phosphatase non-receptor type 22
Synonyms:
3.1.3.48 LyP Lymphoid phosphatase (Lyp) PEST-domain phosphatase PTPN22 Tyrosine-protein phosphatase non-receptor type 22 (LYP) | tyrosine-protein phosphatase non-receptor type 22 isoform 1
Type:
Mol. Mass.:
91712.31
Organism:
Homo sapiens (Human)
Description:
Q9Y2R2
Residue:
807
  
Inhibitor
Name:
BDBM88749
Synonyms:
4-hydroxy-N-[(E)-[4-[2-(3-nitroanilino)-2-oxoethoxy]phenyl]methylideneamino]benzamide MLS000714465 SMR000274444 | cid_9564046
Type:
Small organic molecule
Emp. Form.:
C22H18N4O6
Mol. Mass.:
434.4015
SMILES:
Oc1ccc(cc1)C(=O)N\N=C\c1ccc(OCC(=O)Nc2cccc(c2)[N+]([O-])=O)cc1
: