Target
Tyrosine-protein phosphatase non-receptor type 22
Ligand
BDBM51775
Substrate
Meas. Tech.
Dose Response selectivity of inhibitors of STriatal-Enriched Phosphatase (STEP) in the Lymphoid Phosphatase (PTPN22) Inhibition Assay
IC50
7255±184 nM
Citation
 PubChem, PC Dose Response selectivity of inhibitors of STriatal-Enriched Phosphatase (STEP) in the Lymphoid Phosphatase (PTPN22) Inhibition Assay PubChem Bioassay (2012)[AID] 
Target
Name:
Tyrosine-protein phosphatase non-receptor type 22
Synonyms:
3.1.3.48 LyP Lymphoid phosphatase (Lyp) PEST-domain phosphatase PTPN22 Tyrosine-protein phosphatase non-receptor type 22 (LYP) | tyrosine-protein phosphatase non-receptor type 22 isoform 1
Type:
Mol. Mass.:
91712.31
Organism:
Homo sapiens (Human)
Description:
Q9Y2R2
Residue:
807
  
Inhibitor
Name:
BDBM51775
Synonyms:
2-[2-[(N''E)-N''-[4-(2,4-dichlorobenzyl)oxy-3-ethoxy-benzylidene]hydrazino]-4-keto-2-thiazolin-5-yl]acetic acid 2-[2-[2-[[4-[(2,4-dichlorophenyl)methoxy]-3-ethoxy-phenyl]methylidene]hydrazinyl]-4-oxidanylidene-1,3-thiazol-5-yl]ethanoic acid 2-[2-[2-[[4-[(2,4-dichlorophenyl)methoxy]-3-ethoxyphenyl]methylidene]hydrazinyl]-4-oxo-5-thiazolyl]acetic acid MLS000689950 [2-({4-[(2,4-dichlorobenzyl)oxy]-3-ethoxybenzylidene}hydrazono)-4-oxo-1,3-thiazolidin-5-yl]acetic acid | cid_2908705
Type:
Small organic molecule
Emp. Form.:
C21H19Cl2N3O5S
Mol. Mass.:
496.364
SMILES:
CCOc1cc(CN=Nc2nc(O)c(CC(O)=O)s2)ccc1OCc1ccc(Cl)cc1Cl
: