Target
Tyrosine-protein phosphatase non-receptor type 22
Ligand
BDBM51777
Substrate
Meas. Tech.
Dose Response selectivity of inhibitors of STriatal-Enriched Phosphatase (STEP) in the Lymphoid Phosphatase (PTPN22) Inhibition Assay
IC50
9002±549 nM
Citation
 PubChem, PC Dose Response selectivity of inhibitors of STriatal-Enriched Phosphatase (STEP) in the Lymphoid Phosphatase (PTPN22) Inhibition Assay PubChem Bioassay (2012)[AID] 
Target
Name:
Tyrosine-protein phosphatase non-receptor type 22
Synonyms:
3.1.3.48 LyP Lymphoid phosphatase (Lyp) PEST-domain phosphatase PTPN22 Tyrosine-protein phosphatase non-receptor type 22 (LYP) | tyrosine-protein phosphatase non-receptor type 22 isoform 1
Type:
Mol. Mass.:
91712.31
Organism:
Homo sapiens (Human)
Description:
Q9Y2R2
Residue:
807
  
Inhibitor
Name:
BDBM51777
Synonyms:
3-[7-[(6-chloranyl-1,3-benzodioxol-5-yl)methoxy]-4,8-dimethyl-2-oxidanylidene-chromen-3-yl]propanoic acid 3-[7-[(6-chloro-1,3-benzodioxol-5-yl)methoxy]-4,8-dimethyl-2-oxo-1-benzopyran-3-yl]propanoic acid 3-{7-[(6-chloro-1,3-benzodioxol-5-yl)methoxy]-4,8-dimethyl-2-oxo-2H-chromen-3-yl}propanoic acid SMR000300092 | cid_1800867
Type:
Small organic molecule
Emp. Form.:
C22H19ClO7
Mol. Mass.:
430.835
SMILES:
Cc1c(OCc2cc3OCOc3cc2Cl)ccc2c(C)c(CCC(O)=O)c(=O)oc12
: