Target
Tyrosine-protein phosphatase non-receptor type 22
Ligand
BDBM82815
Substrate
Meas. Tech.
Dose Response selectivity of inhibitors of STriatal-Enriched Phosphatase (STEP) in the Lymphoid Phosphatase (PTPN22) Inhibition Assay
IC50
60173±2000 nM
Citation
 PubChem, PC Dose Response selectivity of inhibitors of STriatal-Enriched Phosphatase (STEP) in the Lymphoid Phosphatase (PTPN22) Inhibition Assay PubChem Bioassay (2012)[AID] 
Target
Name:
Tyrosine-protein phosphatase non-receptor type 22
Synonyms:
3.1.3.48 LyP Lymphoid phosphatase (Lyp) PEST-domain phosphatase PTPN22 Tyrosine-protein phosphatase non-receptor type 22 (LYP) | tyrosine-protein phosphatase non-receptor type 22 isoform 1
Type:
Mol. Mass.:
91712.31
Organism:
Homo sapiens (Human)
Description:
Q9Y2R2
Residue:
807
  
Inhibitor
Name:
BDBM82815
Synonyms:
(3-amino-7-methoxy-1-pyrazolo[3,4-b]quinolinyl)-(3-fluorophenyl)methanone (3-amino-7-methoxypyrazolo[3,4-b]quinolin-1-yl)-(3-fluorophenyl)methanone 1-(3-fluorobenzoyl)-7-methoxy-1H-pyrazolo[3,4-b]quinolin-3-amine SMR000309569 | cid_16195356
Type:
Small organic molecule
Emp. Form.:
C18H13FN4O2
Mol. Mass.:
336.3198
SMILES:
COc1ccc2cc3c(N)nn(C(=O)c4cccc(F)c4)c3nc2c1
: