Target
Tyrosine-protein phosphatase non-receptor type 22
Ligand
BDBM61241
Substrate
Meas. Tech.
Dose Response selectivity of inhibitors of STriatal-Enriched Phosphatase (STEP) in the Lymphoid Phosphatase (PTPN22) Inhibition Assay
IC50
12729±428 nM
Citation
 PubChem, PC Dose Response selectivity of inhibitors of STriatal-Enriched Phosphatase (STEP) in the Lymphoid Phosphatase (PTPN22) Inhibition Assay PubChem Bioassay (2012)[AID] 
Target
Name:
Tyrosine-protein phosphatase non-receptor type 22
Synonyms:
3.1.3.48 LyP Lymphoid phosphatase (Lyp) PEST-domain phosphatase PTPN22 Tyrosine-protein phosphatase non-receptor type 22 (LYP) | tyrosine-protein phosphatase non-receptor type 22 isoform 1
Type:
Mol. Mass.:
91712.31
Organism:
Homo sapiens (Human)
Description:
Q9Y2R2
Residue:
807
  
Inhibitor
Name:
BDBM61241
Synonyms:
2-[7-(2-chloro-4-fluoro-benzyl)oxy-2-keto-4,8-dimethyl-chromen-3-yl]acetic acid 2-[7-[(2-chloro-4-fluorophenyl)methoxy]-4,8-dimethyl-2-oxo-1-benzopyran-3-yl]acetic acid MLS001213411 cid_1304048
Type:
Small organic molecule
Emp. Form.:
C20H16ClFO5
Mol. Mass.:
390.789
SMILES:
Cc1c(OCc2ccc(F)cc2Cl)ccc2c(C)c(CC(O)=O)c(=O)oc12
: