Target
Tyrosine-protein phosphatase non-receptor type 22
Ligand
BDBM88792
Substrate
Meas. Tech.
Dose Response selectivity of inhibitors of STriatal-Enriched Phosphatase (STEP) in the Lymphoid Phosphatase (PTPN22) Inhibition Assay
IC50
30248±1740 nM
Citation
 PubChem, PC Dose Response selectivity of inhibitors of STriatal-Enriched Phosphatase (STEP) in the Lymphoid Phosphatase (PTPN22) Inhibition Assay PubChem Bioassay (2012)[AID] 
Target
Name:
Tyrosine-protein phosphatase non-receptor type 22
Synonyms:
3.1.3.48 LyP Lymphoid phosphatase (Lyp) PEST-domain phosphatase PTPN22 Tyrosine-protein phosphatase non-receptor type 22 (LYP) | tyrosine-protein phosphatase non-receptor type 22 isoform 1
Type:
Mol. Mass.:
91712.31
Organism:
Homo sapiens (Human)
Description:
Q9Y2R2
Residue:
807
  
Inhibitor
Name:
BDBM88792
Synonyms:
3-chloranyl-N-[4-[[(E)-pyridin-3-ylmethylideneamino]carbamoyl]phenyl]benzamide 3-chloro-N-[4-[[(E)-pyridin-3-ylmethylideneamino]carbamoyl]phenyl]benzamide MLS000912241 cid_46496241
Type:
Small organic molecule
Emp. Form.:
C20H15ClN4O2
Mol. Mass.:
378.812
SMILES:
Clc1cccc(c1)C(=O)Nc1ccc(cc1)C(=O)N\N=C\c1cccnc1
: