Target
Tyrosine-protein phosphatase non-receptor type 22
Ligand
BDBM88797
Substrate
Meas. Tech.
Dose Response selectivity of inhibitors of STriatal-Enriched Phosphatase (STEP) in the Lymphoid Phosphatase (PTPN22) Inhibition Assay
IC50
16473±636 nM
Citation
 PubChem, PC Dose Response selectivity of inhibitors of STriatal-Enriched Phosphatase (STEP) in the Lymphoid Phosphatase (PTPN22) Inhibition Assay PubChem Bioassay (2012)[AID] 
Target
Name:
Tyrosine-protein phosphatase non-receptor type 22
Synonyms:
3.1.3.48 LyP Lymphoid phosphatase (Lyp) PEST-domain phosphatase PTPN22 Tyrosine-protein phosphatase non-receptor type 22 (LYP) | tyrosine-protein phosphatase non-receptor type 22 isoform 1
Type:
Mol. Mass.:
91712.31
Organism:
Homo sapiens (Human)
Description:
Q9Y2R2
Residue:
807
  
Inhibitor
Name:
BDBM88797
Synonyms:
2-[(5E)-5-[4-[2-(3,4-dimethylanilino)-2-keto-ethoxy]-3-methoxy-benzylidene]-4-keto-2-thioxo-thiazolidin-3-yl]acetic acid 2-[(5E)-5-[[4-[2-(3,4-dimethylanilino)-2-oxoethoxy]-3-methoxyphenyl]methylidene]-4-oxo-2-sulfanylidene-3-thiazolidinyl]acetic acid MLS001034710 cid_2186383
Type:
Small organic molecule
Emp. Form.:
C23H22N2O6S2
Mol. Mass.:
486.561
SMILES:
COc1cc(\C=C2\SC(=S)N(CC(O)=O)C2=O)ccc1OCC(=O)Nc1ccc(C)c(C)c1
: