Target
Tyrosine-protein phosphatase non-receptor type 22
Ligand
BDBM88800
Substrate
Meas. Tech.
Dose Response selectivity of inhibitors of STriatal-Enriched Phosphatase (STEP) in the Lymphoid Phosphatase (PTPN22) Inhibition Assay
IC50
11358±807 nM
Citation
 PubChem, PC Dose Response selectivity of inhibitors of STriatal-Enriched Phosphatase (STEP) in the Lymphoid Phosphatase (PTPN22) Inhibition Assay PubChem Bioassay (2012)[AID] 
Target
Name:
Tyrosine-protein phosphatase non-receptor type 22
Synonyms:
3.1.3.48 LyP Lymphoid phosphatase (Lyp) PEST-domain phosphatase PTPN22 Tyrosine-protein phosphatase non-receptor type 22 (LYP) | tyrosine-protein phosphatase non-receptor type 22 isoform 1
Type:
Mol. Mass.:
91712.31
Organism:
Homo sapiens (Human)
Description:
Q9Y2R2
Residue:
807
  
Inhibitor
Name:
BDBM88800
Synonyms:
4-acetyl-N-[3-(1-tetrazolyl)phenyl]benzenesulfonamide 4-ethanoyl-N-[3-(1,2,3,4-tetrazol-1-yl)phenyl]benzenesulfonamide SMR000651739 | cid_7693352
Type:
Small organic molecule
Emp. Form.:
C15H13N5O3S
Mol. Mass.:
343.36
SMILES:
CC(=O)c1ccc(cc1)S(=O)(=O)Nc1cccc(c1)-n1cnnn1
: