Target
Tyrosine-protein phosphatase non-receptor type 22
Ligand
BDBM61257
Substrate
Meas. Tech.
Dose Response selectivity of inhibitors of STriatal-Enriched Phosphatase (STEP) in the Lymphoid Phosphatase (PTPN22) Inhibition Assay
IC50
30998±748 nM
Citation
 PubChem, PC Dose Response selectivity of inhibitors of STriatal-Enriched Phosphatase (STEP) in the Lymphoid Phosphatase (PTPN22) Inhibition Assay PubChem Bioassay (2012)[AID] 
Target
Name:
Tyrosine-protein phosphatase non-receptor type 22
Synonyms:
3.1.3.48 LyP Lymphoid phosphatase (Lyp) PEST-domain phosphatase PTPN22 Tyrosine-protein phosphatase non-receptor type 22 (LYP) | tyrosine-protein phosphatase non-receptor type 22 isoform 1
Type:
Mol. Mass.:
91712.31
Organism:
Homo sapiens (Human)
Description:
Q9Y2R2
Residue:
807
  
Inhibitor
Name:
BDBM61257
Synonyms:
2-(2-keto-4-propyl-chromen-7-yl)oxy-N-(4-sulfamoylphenyl)acetamide 2-(2-oxo-4-propylchromen-7-yl)oxy-N-(4-sulfamoylphenyl)acetamide MLS001159997 cid_8034406
Type:
Small organic molecule
Emp. Form.:
C20H20N2O6S
Mol. Mass.:
416.448
SMILES:
CCCc1cc(=O)oc2cc(OCC(=O)Nc3ccc(cc3)S(N)(=O)=O)ccc12
: