Target
Tyrosine-protein phosphatase non-receptor type 22
Ligand
BDBM76022
Substrate
Meas. Tech.
Dose Response selectivity of inhibitors of STriatal-Enriched Phosphatase (STEP) in the Lymphoid Phosphatase (PTPN22) Inhibition Assay
IC50
74102±99300000 nM
Citation
 PubChem, PC Dose Response selectivity of inhibitors of STriatal-Enriched Phosphatase (STEP) in the Lymphoid Phosphatase (PTPN22) Inhibition Assay PubChem Bioassay (2012)[AID] 
Target
Name:
Tyrosine-protein phosphatase non-receptor type 22
Synonyms:
3.1.3.48 LyP Lymphoid phosphatase (Lyp) PEST-domain phosphatase PTPN22 Tyrosine-protein phosphatase non-receptor type 22 (LYP) | tyrosine-protein phosphatase non-receptor type 22 isoform 1
Type:
Mol. Mass.:
91712.31
Organism:
Homo sapiens (Human)
Description:
Q9Y2R2
Residue:
807
  
Inhibitor
Name:
BDBM76022
Synonyms:
5-bromanyl-N-[4-(6-methoxypyridazin-3-yl)phenyl]furan-2-carboxamide 5-bromo-N-[4-(6-methoxypyridazin-3-yl)phenyl]-2-furamide MLS001236653 cid_7593595
Type:
Small organic molecule
Emp. Form.:
C16H12BrN3O3
Mol. Mass.:
374.189
SMILES:
COc1ccc(nn1)-c1ccc(NC(=O)c2ccc(Br)o2)cc1
: