Target
Tyrosine-protein phosphatase non-receptor type 22
Ligand
BDBM60868
Substrate
Meas. Tech.
Dose Response selectivity of inhibitors of STriatal-Enriched Phosphatase (STEP) in the Lymphoid Phosphatase (PTPN22) Inhibition Assay
IC50
4480±269 nM
Citation
 PubChem, PC Dose Response selectivity of inhibitors of STriatal-Enriched Phosphatase (STEP) in the Lymphoid Phosphatase (PTPN22) Inhibition Assay PubChem Bioassay (2012)[AID] 
Target
Name:
Tyrosine-protein phosphatase non-receptor type 22
Synonyms:
3.1.3.48 LyP Lymphoid phosphatase (Lyp) PEST-domain phosphatase PTPN22 Tyrosine-protein phosphatase non-receptor type 22 (LYP) | tyrosine-protein phosphatase non-receptor type 22 isoform 1
Type:
Mol. Mass.:
91712.31
Organism:
Homo sapiens (Human)
Description:
Q9Y2R2
Residue:
807
  
Inhibitor
Name:
BDBM60868
Synonyms:
2,3-bis(sulfanyl)butanedioic acid 2,3-dimercaptosuccinic acid SMR000499575 meso-2,3-Dimercaptosuccinic acid
Type:
Small organic molecule
Emp. Form.:
C4H6O4S2
Mol. Mass.:
182.218
SMILES:
OC(=O)C(S)C(S)C(O)=O
: