Target
dCTP deaminase
Ligand
BDBM50173531
Substrate
Meas. Tech.
Inhibition Assay
pH
8±0
Temperature
298.15±0 K
Ki
1.000000e+9±n/a nM
Citation
 Musso-Buendía, JAVidal, AEKasinthan, GNguyen, CCarrero-Lérida, JRuiz-Pérez, LMWilson, KJohansson, NGGilbert, IHGonzález-Pacanowska, D Kinetic properties and inhibition of the dimeric dUTPase-dUDPase from Campylobacter jejuni. J Enzyme Inhib Med Chem 24:111-6 (2009)  
Target
Name:
dCTP deaminase
Synonyms:
DCD_CAMJE dcd
Type:
Protein
Mol. Mass.:
20698.65
Organism:
Campylobacter jejuni
Description:
Residue:
186
  
Inhibitor
Name:
BDBM50173531
Synonyms:
1-(4-Hydroxy-5-triphenylsilanyloxymethyl-tetrahydro-furan-2-yl)-1H-pyrimidine-2,4-dione dUTPase inhibitor, 8
Type:
Small organic molecule
Emp. Form.:
C27H26N2O5Si
Mol. Mass.:
486.5912
SMILES:
OC1CC(OC1CO[Si](c1ccccc1)(c1ccccc1)c1ccccc1)n1ccc(=O)[nH]c1=O
: