Target
Cyclin-dependent kinase 2
Ligand
BDBM91766
Substrate
Meas. Tech.
OctetRed
pH
7.5±n/a
Temperature
298.15±n/a K
Kd
>100000±n/a nM
Citation
 CSARdock, CD CDK2 in CSAR_FULL_RELEASE_3JULY2012 CSAR 1:0 (2012)  
Target
Name:
Cyclin-dependent kinase 2
Synonyms:
CDK2 CDK2_HUMAN Cell division protein kinase 2 Protein cereblon/Cyclin-dependent kinase 2 | p33 protein kinase
Type:
Enzyme Subunit
Mol. Mass.:
33938.17
Organism:
Homo sapiens (Human)
Description:
P24941
Residue:
298
  
Inhibitor
Name:
BDBM91766
Synonyms:
CS202
Type:
Emp. Form.:
C14H18N4O4S
Mol. Mass.:
338.382
SMILES:
COc1cc(NC(=O)CSc2nncn2C)cc(OC)c1OC
: