Target
Phosphoethanolamine N-methyltransferase 2
Ligand
BDBM50041457
Substrate
Meas. Tech.
Radiochemical Assay
pH
8±0
Temperature
298.15±0 K
IC50
3100000±300000 nM
Citation
 Lee, SGHaakenson, WMcCarter, JPWilliams, DJHresko, MCJez, JM Thermodynamic evaluation of ligand binding in the plant-like phosphoethanolamine methyltransferases of the parasitic nematode Haemonchus contortus. J Biol Chem 286:38060-8 (2011)  
Target
Name:
Phosphoethanolamine N-methyltransferase 2
Synonyms:
Phosphoehtnaolamine Methyltransferases 2 (PMT2)
Type:
Enzyme
Mol. Mass.:
49764.45
Organism:
Caenorhabditis elegans
Description:
Q22993
Residue:
437
  
Inhibitor
Name:
BDBM50041457
Synonyms:
4-[(7-chloroquinolin-4-yl)amino]-2-[(diethylamino)methyl]phenol CHEMBL682 | med.21724, Compound 188
Type:
Small organic molecule
Emp. Form.:
C20H22ClN3O
Mol. Mass.:
355.861
SMILES:
CCN(CC)Cc1cc(Nc2ccnc3cc(Cl)ccc23)ccc1O
: