Target
Urokinase-type plasminogen activator
Ligand
BDBM92485
Substrate
Meas. Tech.
Enzymatic Assay
pH
7.8±0
Temperature
296.15±0 K
IC50
10±1 nM
Citation
 Cale, JMLi, SHWarnock, MSu, EJNorth, PRSanders, KLPuscau, MMEmal, CDLawrence, DA Characterization of a novel class of polyphenolic inhibitors of plasminogen activator inhibitor-1. J Biol Chem 285:7892-902 (2010)  
Target
Name:
Urokinase-type plasminogen activator
Synonyms:
3.4.21.73 U-plasminogen activator Urokinase Urokinase-type plasminogen activator chain B Urokinase-type plasminogen activator short chain A uPA
Type:
Enzyme
Mol. Mass.:
48528.62
Organism:
Homo sapiens (Human)
Description:
P00749
Residue:
431
  
Inhibitor
Name:
BDBM92485
Synonyms:
CDE-066 | US9120744, CDE-066
Type:
Large molecule
Emp. Form.:
C41H32O26
Mol. Mass.:
940.6772
SMILES:
Oc1cc(cc(O)c1O)C(=O)OC[C@H]1OC(OC(=O)c2cc(O)c(O)c(O)c2)[C@H](OC(=O)c2cc(O)c(O)c(O)c2)[C@@H](OC(=O)c2cc(O)c(O)c(O)c2)[C@H]1OC(=O)c1cc(O)c(O)c(O)c1
: