Target
Plasminogen activator inhibitor 1
Ligand
BDBM92487
Substrate
Meas. Tech.
Enzymatic Assay
pH
7.8±0
Temperature
296.15±0 K
Kd
31±2 nM
Citation
 Cale, JMLi, SHWarnock, MSu, EJNorth, PRSanders, KLPuscau, MMEmal, CDLawrence, DA Characterization of a novel class of polyphenolic inhibitors of plasminogen activator inhibitor-1. J Biol Chem 285:7892-902 (2010)  
Target
Name:
Plasminogen activator inhibitor 1
Synonyms:
Endothelial plasminogen activator inhibitor PAI-1 PAI1_HUMAN Plasminogen activator inhibitor 1 Plasminogen activator inhibitor-1 SERPINE1
Type:
Enzyme
Mol. Mass.:
45064.00
Organism:
Homo sapiens (Human)
Description:
P05121
Residue:
402
  
Inhibitor
Name:
BDBM92487
Synonyms:
CDE-031 | US9120744, CDE-031
Type:
Small organic molecule
Emp. Form.:
C20H20O10
Mol. Mass.:
420.3668
SMILES:
Oc1cc(cc(O)c1O)C(=O)O[C@@H]1CCCC[C@@H]1OC(=O)c1cc(O)c(O)c(O)c1
: