Target
Plasminogen activator inhibitor 1
Ligand
BDBM92485
Substrate
Meas. Tech.
Enzymatic Assay
pH
7.8±0
Temperature
296.15±0 K
Kd
3.1±0.2 nM
Citation
 Cale, JMLi, SHWarnock, MSu, EJNorth, PRSanders, KLPuscau, MMEmal, CDLawrence, DA Characterization of a novel class of polyphenolic inhibitors of plasminogen activator inhibitor-1. J Biol Chem 285:7892-902 (2010)  
Target
Name:
Plasminogen activator inhibitor 1
Synonyms:
Endothelial plasminogen activator inhibitor PAI-1 PAI1_HUMAN Plasminogen activator inhibitor 1 Plasminogen activator inhibitor-1 SERPINE1
Type:
Enzyme
Mol. Mass.:
45064.00
Organism:
Homo sapiens (Human)
Description:
P05121
Residue:
402
  
Inhibitor
Name:
BDBM92485
Synonyms:
CDE-066 | US9120744, CDE-066
Type:
Large molecule
Emp. Form.:
C41H32O26
Mol. Mass.:
940.6772
SMILES:
Oc1cc(cc(O)c1O)C(=O)OC[C@H]1OC(OC(=O)c2cc(O)c(O)c(O)c2)[C@H](OC(=O)c2cc(O)c(O)c(O)c2)[C@@H](OC(=O)c2cc(O)c(O)c(O)c2)[C@H]1OC(=O)c1cc(O)c(O)c(O)c1
: