Target
Cyclin-dependent kinase 2
Ligand
BDBM50088360
Substrate
Meas. Tech.
Inhibition Assay
IC50
1.7e+4± 1.3e+3 nM
Citation
 Martin, MPAlam, RBetzi, SIngles, DJZhu, JYSchönbrunn, E A Novel Approach to the Discovery of Small-Molecule Ligands of CDK2. Chembiochem 13:2128-36 (2012)  
Target
Name:
Cyclin-dependent kinase 2
Synonyms:
CDK2 CDK2_HUMAN Cell division protein kinase 2 Protein cereblon/Cyclin-dependent kinase 2 | p33 protein kinase
Type:
Enzyme Subunit
Mol. Mass.:
33938.17
Organism:
Homo sapiens (Human)
Description:
P24941
Residue:
298
  
Inhibitor
Name:
BDBM50088360
Synonyms:
2,3,4,6-tetrahydroxy-5H-benzo[7]annulen-5-one 2,3,4,6-tetrahydroxybenzocyclohepten-5-one Hit compound, 2 purpurogalline
Type:
Small organic molecule
Emp. Form.:
C11H8O5
Mol. Mass.:
220.1782
SMILES:
Oc1cc2cccc(O)c(=O)c2c(O)c1O
: