Target
Casein kinase I isoform alpha
Ligand
BDBM15211
Substrate
Meas. Tech.
Enzyme Assay
Temperature
303.15±0 K
Ki
3.83e+4± 6.0e+3 nM
Citation
 Chijiwa, TMishima, AHagiwara, MSano, MHayashi, KInoue, TNaito, KToshioka, THidaka, H Inhibition of forskolin-induced neurite outgrowth and protein phosphorylation by a newly synthesized selective inhibitor of cyclic AMP-dependent protein kinase, N-[2-(p-bromocinnamylamino)ethyl]-5-isoquinolinesulfonamide (H-89), of PC12D pheochromocytoma cells. J Biol Chem 265:5267-72 (1990) Target
Name:
Casein kinase I isoform alpha
Synonyms:
CK1 CSNK1A1 Casein kinase 1 alpha (CK1 alpha) KC1A_HUMAN
Type:
Serine/threonine-protein kinase
Mol. Mass.:
38936.59
Organism:
Homo sapiens (Human)
Description:
P48729
Residue:
337
  
Inhibitor
Name:
BDBM15211
Synonyms:
CHEMBL104264 H89 N-(2-{[(2E)-3-(4-bromophenyl)prop-2-en-1-yl]amino}ethyl)isoquinoline-5-sulfonamide | N-[2-[[(E)-3-(4-bromophenyl)prop-2-enyl]amino]ethyl]isoquinoline-5-sulfonamide
Type:
Small organic molecule
Emp. Form.:
C20H20BrN3O2S
Mol. Mass.:
446.361
SMILES:
Brc1ccc(\C=C\CNCCNS(=O)(=O)c2cccc3cnccc23)cc1
: