Target
Phosphatidylcholine-sterol acyltransferase
Ligand
BDBM92614
Substrate
Meas. Tech.
Enzyme Assay
pH
7.5±0
Temperature
277.15±0 K
IC50
60±0.0 nM
Citation
 Jauhiainen, MYuan, wGelb, MHDolphin, J Human Plasma Lecithin-Cholesterol Acyltransferase J Biol Chem 264:1963-1967 (1989)   
Target
Name:
Phosphatidylcholine-sterol acyltransferase
Synonyms:
LCAT Lecithin-cholesterol acyltransferase (LCAT) Phospholipid-cholesterol acyltransferase
Type:
Protein
Mol. Mass.:
49573.79
Organism:
Homo sapiens (Human)
Description:
P04180
Residue:
440
  
Inhibitor
Name:
BDBM92614
Synonyms:
Difluoroketone phospholipid analogue, 2
Type:
Emp. Form.:
C25H50F2NO6P
Mol. Mass.:
529.6382
SMILES:
CCCCCCCCOCC(COP([O-])(=O)OCC[N+](C)(C)C)C(F)(F)C(=O)CCCCCCC
: