Target
Beta-adrenergic receptor kinase 1
Ligand
BDBM25392
Substrate
Meas. Tech.
Inhibition Assay
Kd
200±0.0 nM
Citation
 Strader, CDCandelore, MRHill, WSSigal, ISDixon, RA Identification of two serine residues involved in agonist activation of the beta-adrenergic receptor. J Biol Chem 264:13572-8 (1989) Target
Name:
Beta-adrenergic receptor kinase 1
Synonyms:
ADRBK1 BARK Beta-ARK-1 G-protein coupled receptor kinase 2 GRK2
Type:
Enzyme
Mol. Mass.:
79581.30
Organism:
Homo sapiens (Human)
Description:
P25098
Residue:
689
  
Inhibitor
Name:
BDBM25392
Synonyms:
4-[1-hydroxy-2-(isopropylamino)ethyl]pyrocatechol;hydrochloride 4-{1-hydroxy-2-[(propan-2-yl)amino]ethyl}benzene-1,2-diol, 2 ISOPROTERONOL Isoproterenol Isoproterenol,(+) Norisodrine | Novodrin
Type:
Small organic molecule
Emp. Form.:
C11H17NO3
Mol. Mass.:
211.2576
SMILES:
CC(C)NCC(O)c1ccc(O)c(O)c1
: