Target
2,6-dichloro-p-hydroquinone 1,2-dioxygenase
Ligand
BDBM92753
Substrate
Meas. Tech.
Inhibition Assay
Ki
4.8e+4± 6e+3 nM
Citation
 Machonkin, TEDoerner, AE Substrate specificity of Sphingobium chlorophenolicum 2,6-dichlorohydroquinone 1,2-dioxygenase. Biochemistry 50:8899-913 (2011)  
Target
Name:
2,6-dichloro-p-hydroquinone 1,2-dioxygenase
Synonyms:
2,6-dichloro-p-hydroquinone 1,2-dioxygenase (PcpA)
Type:
Protein
Mol. Mass.:
36504.22
Organism:
Sphingobium chlorophenolicum
Description:
Q9ZBB0
Residue:
320
  
Inhibitor
Name:
BDBM92753
Synonyms:
2,6-Dichlorophenol | 2,6-Dichlorophenol (2,6-DCP)
Type:
Small molecule
Emp. Form.:
C6H4Cl2O
Mol. Mass.:
163.001
SMILES:
Oc1c(Cl)cccc1Cl
: