Target
Egl nine homolog 1
Ligand
BDBM93423
Substrate
Meas. Tech.
PHD Enzymatic Assay
IC50
90.2±0.0 nM
Citation
 Murray, JKBalan, CAllgeier, AMKasparian, AViswanadhan, VWilde, CAllen, JRYoder, SCBiddlecome, GHungate, RWMiranda, LP Dipeptidyl-quinolone derivatives inhibit hypoxia inducible factor-1a prolyl hydroxylases-1, -2, and -3 with altered selectivity. J Comb Chem 12:676-86 (2010)  
Target
Name:
Egl nine homolog 1
Synonyms:
C1orf12 EGLN1_HUMAN Hypoxia-inducible factor prolyl hydroxylase 2 (HIF-PH2) Prolyl hydroxylase domain-containing protein 2 (PHD2)
Type:
Protein
Mol. Mass.:
46035.59
Organism:
Homo sapiens (Human)
Description:
Q9GZT9
Residue:
426
  
Inhibitor
Name:
BDBM93423
Synonyms:
PHD Inhibitor, 12{2,3,2} | PHD Inhibitor, 12{2,4,2}
Type:
Small molecule
Emp. Form.:
C34H35N5O8
Mol. Mass.:
641.6704
SMILES:
CC(=O)N[C@H](Cc1ccccc1)C(=O)N[C@H](Cc1ccccc1)C(=O)NCc1ccc2n(C)c(=O)c(C(=O)NCC(O)=O)c(O)c2c1
: