Target
Beta-lactamase
Ligand
BDBM67258
Substrate
IC50
19929±n/a nM
Citation
 PubChem, PC Counterscreen for inhibitors of the interaction of nucleotide-binding oligomerization domain containing 2 (NOD2) and receptor-interacting serine-threonine kinase 2 (RIPK2) PubChem Bioassay (2012)[AID] 
Target
Name:
Beta-lactamase
Synonyms:
Beta lactamase
Type:
Enzyme Catalytic Domain
Mol. Mass.:
31513.38
Organism:
Pseudomonas aeruginosa
Description:
gi_114881106
Residue:
286
  
Inhibitor
Name:
BDBM67258
Synonyms:
(E)-N-[2-(cyclohexylamino)-2-keto-ethyl]-4-(2-hydroxy-4-methoxy-phenyl)-4-keto-N-(tetrahydrofurfuryl)but-2-enamide (E)-N-[2-(cyclohexylamino)-2-oxoethyl]-4-(2-hydroxy-4-methoxyphenyl)-4-oxo-N-(2-oxolanylmethyl)-2-butenamide MLS000714570 cid_5770964
Type:
Small organic molecule
Emp. Form.:
C24H32N2O6
Mol. Mass.:
444.5207
SMILES:
COc1ccc(C(=O)\C=C\C(=O)N(CC2CCCO2)CC(=O)NC2CCCCC2)c(O)c1
: