Target
Beta-lactamase
Ligand
BDBM66070
Substrate
IC50
15543±n/a nM
Citation
 PubChem, PC Counterscreen for inhibitors of the interaction of nucleotide-binding oligomerization domain containing 2 (NOD2) and receptor-interacting serine-threonine kinase 2 (RIPK2) PubChem Bioassay (2012)[AID] 
Target
Name:
Beta-lactamase
Synonyms:
Beta lactamase
Type:
Enzyme Catalytic Domain
Mol. Mass.:
31513.38
Organism:
Pseudomonas aeruginosa
Description:
gi_114881106
Residue:
286
  
Inhibitor
Name:
BDBM66070
Synonyms:
1-(2-benzoylphenyl)-2,5-dihydro-1H-pyrrole-2,5-dione 1-(2-benzoylphenyl)pyrrole-2,5-dione MLS000861680 cid_2731237
Type:
Small organic molecule
Emp. Form.:
C17H11NO3
Mol. Mass.:
277.2741
SMILES:
O=C(c1ccccc1)c1ccccc1N1C(=O)C=CC1=O
: