Target
Beta-lactamase
Ligand
BDBM60974
Substrate
IC50
14096±n/a nM
Citation
 PubChem, PC Counterscreen for inhibitors of the interaction of nucleotide-binding oligomerization domain containing 2 (NOD2) and receptor-interacting serine-threonine kinase 2 (RIPK2) PubChem Bioassay (2012)[AID] 
Target
Name:
Beta-lactamase
Synonyms:
Beta lactamase
Type:
Enzyme Catalytic Domain
Mol. Mass.:
31513.38
Organism:
Pseudomonas aeruginosa
Description:
gi_114881106
Residue:
286
  
Inhibitor
Name:
BDBM60974
Synonyms:
MLS001291206 N-[3-(2,5-dioxo-1-pyrrolyl)phenyl]-2-thiophenecarboxamide N-[3-[2,5-bis(oxidanylidene)pyrrol-1-yl]phenyl]thiophene-2-carboxamide Thiophene-2-carboxylic acid [3-(2,5-dioxo-2,5-dihydro-pyrrol-1-yl)-phenyl]-amide | cid_881135
Type:
Small organic molecule
Emp. Form.:
C15H10N2O3S
Mol. Mass.:
298.316
SMILES:
O=C(Nc1cccc(c1)N1C(=O)C=CC1=O)c1cccs1
: