Target
Beta-lactamase
Ligand
BDBM81198
Substrate
IC50
10805±n/a nM
Citation
 PubChem, PC Counterscreen for inhibitors of the interaction of nucleotide-binding oligomerization domain containing 2 (NOD2) and receptor-interacting serine-threonine kinase 2 (RIPK2) PubChem Bioassay (2012)[AID] 
Target
Name:
Beta-lactamase
Synonyms:
Beta lactamase
Type:
Enzyme Catalytic Domain
Mol. Mass.:
31513.38
Organism:
Pseudomonas aeruginosa
Description:
gi_114881106
Residue:
286
  
Inhibitor
Name:
BDBM81198
Synonyms:
Ethyl Violet SMR001224407 [4-[bis[4-(diethylamino)phenyl]methylidene]-1-cyclohexa-2,5-dienylidene]-diethylammonium;chloride [4-[bis[4-(diethylamino)phenyl]methylidene]cyclohexa-2,5-dien-1-ylidene]-diethylazanium;chloride | cid_16955
Type:
Small organic molecule
Emp. Form.:
C31H42N3
Mol. Mass.:
456.6847
SMILES:
CCN(CC)c1ccc(cc1)[C+](c1ccc(cc1)N(CC)CC)c1ccc(cc1)N(CC)CC
: