Target
Beta-lactamase
Ligand
BDBM61932
Substrate
IC50
17668±n/a nM
Citation
 PubChem, PC Counterscreen for inhibitors of the interaction of nucleotide-binding oligomerization domain containing 2 (NOD2) and receptor-interacting serine-threonine kinase 2 (RIPK2) PubChem Bioassay (2012)[AID] 
Target
Name:
Beta-lactamase
Synonyms:
Beta lactamase
Type:
Enzyme Catalytic Domain
Mol. Mass.:
31513.38
Organism:
Pseudomonas aeruginosa
Description:
gi_114881106
Residue:
286
  
Inhibitor
Name:
BDBM61932
Synonyms:
2-(3-keto-1,2-benzothiazol-2-yl)-N-(p-tolyl)acetamide KUC104219N N-(4-methylphenyl)-2-(3-oxo-1,2-benzothiazol-2-yl)acetamide | cid_44623834
Type:
Small organic molecule
Emp. Form.:
C16H14N2O2S
Mol. Mass.:
298.36
SMILES:
Cc1ccc(NC(=O)Cn2sc3ccccc3c2=O)cc1
: